{"text_format":"1","workbook":"xlsx","n_sheets":11,"sheets":["A","B","C","D","E3-Cons","E","F","RC","H","C2","E2"],"not_rendered":{"charts":0,"images":0,"macros":1,"external_links":0,"defined_names":10,"comments":0,"pivot_tables":0},"unopened":[],"bounds":{"document_bytes":16777216,"sheet_cells":100000,"rows_first":2000,"rows_last":500,"rows_between":2000,"halvings":0,"cell_chars":16384,"cell_head_chars":4096},"cells_cut":0,"cells_raw":0,"read":"whole","date_system":"1900"}

{"sheet":"A","index":0,"n_rows":81,"n_cols":105,"rows_kept":81,"cut":false,"hidden":false,"merged":[[75,8,75,9],[75,15,75,17],[59,8,59,9],[59,15,59,17],[58,8,58,9],[58,15,58,17],[57,8,57,9],[57,15,57,17],[56,8,56,9],[56,15,56,17],[69,8,69,9],[69,15,69,17],[68,8,68,9],[68,15,68,17],[67,8,67,9],[67,15,67,17],[66,8,66,9],[66,15,66,17],[65,8,65,9],[65,15,65,17],[74,8,74,9],[74,15,74,17],[73,8,73,9],[73,15,73,17],[55,8,55,9],[55,15,55,17],[64,8,64,9],[64,15,64,17],[63,8,63,9],[63,15,63,17],[62,8,62,9],[62,15,62,17],[61,8,61,9],[61,15,61,17],[60,8,60,9],[60,15,60,17],[72,8,72,9],[72,15,72,17],[71,8,71,9],[71,15,71,17],[70,8,70,9],[70,15,70,17],[53,15,53,17],[54,15,54,17],[3,17,3,18],[44,15,44,17],[45,15,45,17],[46,15,46,17],[47,15,47,17],[48,15,48,17],[49,15,49,17],[50,15,50,17],[51,15,51,17],[52,15,52,17],[35,15,35,17],[36,15,36,17],[37,15,37,17],[38,15,38,17],[39,15,39,17],[40,15,40,17],[41,15,41,17],[42,15,42,17],[43,15,43,17],[26,15,26,17],[32,15,32,17],[33,15,33,17],[34,15,34,17],[27,15,27,17],[0,20,1,20],[4,17,4,18],[5,17,5,18],[6,17,6,18],[7,17,7,18],[23,15,23,17],[24,20,25,20],[24,18,25,18],[24,19,25,19],[0,17,1,18],[0,19,1,19],[17,17,17,18],[17,19,17,20],[18,17,18,18],[19,17,19,18],[18,19,18,20],[19,19,19,20],[20,17,20,18],[20,19,20,20],[24,7,25,7],[24,8,25,9],[24,10,25,10],[24,13,25,13],[24,14,25,14],[24,15,25,17],[30,8,30,9],[31,8,31,9],[26,8,26,9],[27,8,27,9],[28,8,28,9],[29,8,29,9],[28,15,28,17],[29,15,29,17],[30,15,30,17],[31,15,31,17],[24,0,25,0],[24,1,25,1],[24,2,25,2],[24,3,25,3],[24,4,25,4],[24,5,25,5],[24,6,25,6],[9,2,9,5],[12,2,12,5],[10,2,10,5],[19,1,19,5],[20,1,20,5],[18,13,18,14],[19,13,19,14],[20,13,20,14],[23,11,23,12],[24,11,24,12],[18,10,18,12],[19,10,19,12],[20,10,20,12],[21,10,21,12],[78,0,78,14],[77,0,77,14],[32,8,32,9],[33,8,33,9],[34,8,34,9],[35,8,35,9],[36,8,36,9],[38,8,38,9],[41,8,41,9],[42,8,42,9],[43,8,43,9],[39,8,39,9],[40,8,40,9],[44,8,44,9],[45,8,45,9],[54,8,54,9],[53,8,53,9],[52,8,52,9],[51,8,51,9],[50,8,50,9],[49,8,49,9],[48,8,48,9],[47,8,47,9],[46,8,46,9],[7,10,7,12],[1,2,1,5],[11,2,11,5],[13,2,13,5],[23,8,23,9],[3,2,3,5],[4,2,4,5],[6,2,6,5],[7,2,7,5],[8,2,8,5],[5,2,5,5],[14,4,14,5],[8,10,8,12],[10,11,10,12],[11,11,11,12],[12,11,12,12],[23,76,23,79],[23,80,23,83],[23,64,23,67],[23,68,23,71],[23,72,23,75],[37,8,37,9],[0,14,1,14],[0,13,1,13],[2,10,2,11],[17,13,17,14],[24,21,25,21],[24,22,25,22],[24,23,25,23],[24,24,25,24],[13,11,13,12],[14,11,14,12],[15,11,15,12],[17,10,17,12],[21,13,21,14],[0,10,1,12],[3,10,3,12],[4,10,4,12],[5,10,5,12],[6,10,6,12]]}
["SECTION A: PROGRAM INFORMATION",null,"(You will ONLY be able to fill-in and select from the shaded fields on this worksheet)",null,null,null,null,null,null,null,{"$f":"IF(X19=\"LMW\",\"Locality Served under Vendor Number\",\"Job Position\")","v":"Job Position"},null,null,{"$f":"IF(X19=\"LMW\",\"Previous Minimim Wage\",\"Current Hourly Wage\")","v":"Current Hourly Wage"},{"$f":"IF(X19=\"LMW\",\"Revised Minimum Wage\",\"Proposed Hourly Wage\")","v":"Proposed Hourly Wage"},null,null,"Cost Allocation \nCategory",null,"Manual Entry","Final",{"$f":"CJ24","v":0},null,null,null,null,{"$f":"A17+1","v":16},"Increase of Existing Service","Yes"]
[1,"Type of Health & Safety Request",{"$f":"VLOOKUP(W13,W14:X15,2,FALSE)","v":"Regular Health & Safety"}]
[]
[{"$f":"A2+1","v":2},"Service Provider Name",null,null,null,null,null,null,null,{"$f":"A19+1","v":18},null,null,null,null,null,null,{"$f":"J22+1","v":33},"General Operations",null,null,{"$f":"V4","v":0},{"$f":"IF(T4=\"\",$CJ$24,IF(1<T4>0,T4,$CJ$24))","v":0},null,null,null,null,null,null,null,null,null,null,null,null,null,null,null,null,null,null,null,null,"Mixed",null,null,null,"actual","month","fy remain"]
[{"$f":"A4+1","v":3},"Vendor Number",null,null,null,null,null,null,null,{"$f":"J4+1","v":19},null,null,null,null,null,null,{"$f":"Q4+1","v":34},"Program Costs",null,null,{"$f":"V5","v":0},{"$f":"IF(T5=\"\",$CJ$24,IF(1<T5>0,T5,$CJ$24))","v":0},null,null,null,null,null,null,null,null,null,null,null,null,null,null,null,null,null,null,null,true,null,null,null,null,null,1,6]
[{"$f":"A5+1","v":4},"Vendor Address",null,null,null,null,null,null,null,{"$f":"J5+1","v":20},null,null,null,null,null,null,{"$f":"Q5+1","v":35},"Program Consultants",null,null,{"$f":"V6","v":0},{"$f":"IF(T6=\"\",$CJ$24,IF(1<T6>0,T6,$CJ$24))","v":0},null,null,null,null,null,null,null,null,null,null,null,null,null,null,null,null,null,null,null,{"$f":"INDEX($AC$6:$AI$10,SMALL(IF(($AP$5=$AJ$6:$AJ$10),ROW($AJ$6:$AJ$10)-MIN(ROW($AJ$6:$AJ$10))+1,\"\"),ROW($A$1:A1)),2)","v":{"$error":"#VALUE!"}},"Hourly","Subcode Specific Distribution"]
[5,"Service Code",null,null,null,null,null,null,null,{"$f":"J6+1","v":21},null,null,null,null,null,null,{"$f":"Q6+1","v":36},"Administrative Costs",null,null,0,{"$f":"IF(T7=\"\",$CJ$24,IF(1<T7>0,T7,$CJ$24))","v":0},null,null,null,null,null,null,null,null,null,null,null,null,null,null,null,null,null,null,null,{"$f":"INDEX($AC$6:$AI$10,SMALL(IF(($AP$5=$AJ$6:$AJ$10),ROW($AJ$6:$AJ$10)-MIN(ROW($AJ$6:$AJ$10))+1,\"\"),ROW(A2)),2)","v":{"$error":"#VALUE!"}},"Daily","Average Distribution",null,null,null,2,5]
[{"$f":"A7+1","v":6},"Staffing Ratio",null,null,null,null,null,null,null,{"$f":"J7+1","v":22},null,null,null,null,null,null,{"$f":"Q7+1","v":37},"Administrative Staff",null,null,0,{"$f":"IF(T8=\"\",$CJ$24,IF(1<T8>0,T8,$CJ$24))","v":0},null,null,null,null,null,null,null,null,null,null,null,null,null,null,null,null,null,{"$f":"K12","v":0},1,{"$f":"INDEX($AC$6:$AI$10,SMALL(IF(($AP$5=$AJ$6:$AJ$10),ROW($AJ$6:$AJ$10)-MIN(ROW($AJ$6:$AJ$10))+1,\"\"),ROW($A$1:A4)),2)","v":{"$error":"#VALUE!"}},"Monthly","N/A (Only one subcode used)"]
[7,"Number of Consumers in Program",null,null,null,null,null,null,null,{"$f":"J8+1","v":23},null,null,null,null,null,null,null,null,null,null,null,null,null,null,null,null,null,null,null,null,null,null,null,null,null,null,null,null,null,{"$f":"K13","v":0},2,{"$f":"INDEX($AC$6:$AI$10,SMALL(IF(($AP$5=$AJ$6:$AJ$10),ROW($AJ$6:$AJ$10)-MIN(ROW($AJ$6:$AJ$10))+1,\"\"),ROW($A$1:A5)),2)","v":{"$error":"#VALUE!"}},"Per-Ride",null,null,null,null,3,4]
[8,"Number of Consumers in Request",null,null,null,null,null,null,null,null,null,null,null,null,null,null,null,null,null,null,null,null,null,null,null,null,null,null,null,null,null,null,null,null,null,null,null,null,null,{"$f":"K14","v":0},3,{"$f":"INDEX($AC$6:$AI$10,SMALL(IF(($AP$5=$AJ$6:$AJ$10),ROW($AJ$6:$AJ$10)-MIN(ROW($AJ$6:$AJ$10))+1,\"\"),ROW($A$1:A6)),2)","v":{"$error":"#VALUE!"}},"Yes",null,null,null,null,4,3]
{"$rows_left_out":72}
{"sheet":"B","index":1,"n_rows":78,"n_cols":11,"rows_kept":78,"cut":false,"hidden":false,"merged":[[54,1,54,4],[33,1,33,5],[38,1,38,5],[37,1,37,5],[67,1,67,5],[41,1,41,5],[43,5,44,5],[43,1,44,4],[50,1,51,4],[50,5,51,5],[77,1,78,5],[77,7,78,7],[49,1,49,4],[48,1,48,4],[46,1,46,4],[47,1,47,4],[64,1,64,5],[65,1,65,5],[66,1,66,5],[63,1,63,5],[58,1,58,7],[55,1,55,4],[56,1,56,4],[52,1,52,4],[69,2,69,7],[53,1,53,4],[7,1,7,7],[15,1,15,7],[21,1,21,7],[30,1,30,4],[45,1,45,4],[36,1,36,4],[39,1,39,5],[40,1,40,5],[31,1,31,5],[32,1,32,5],[34,1,34,5],[35,1,35,5],[16,4,16,6],[17,4,17,6],[18,4,18,6],[19,4,19,6],[71,3,71,5],[72,3,72,5],[73,3,73,5],[74,3,74,5],[75,3,75,5]]}
["SECTION B: PROGRAM COSTS"]
[null,null,null,null,null,null,null,null,null,"Wages","Benefits"]
[null,"Service Provider Name",{"$f":"IF(A!C4=\"\",\"\",A!C4)","v":""},null,null,null,null,null,"Calculated Direct Support Wages (Original)",{"$f":"A!BM78/A!BO78","v":{"$error":"#DIV/0!"}},{"$f":"C17","v":0}]
[null,"Vendor Number",{"$f":"IF(A!C5=\"\",\"\",A!C5)","v":""},null,null,null,null,null,"Calculated Direct Support Wages (Revised)",{"$f":"A!BN78/A!BP78","v":{"$error":"#DIV/0!"}},{"$f":"C17","v":0}]
[null,"Service Code",{"$f":"IF(A!C7=\"\",\"\",A!C7)","v":""},null,null,null,null,null,"Calculated Management Wages (Original)",{"$f":"(A!BY78+A!CC78)/(A!CA78+A!CE78)","v":{"$error":"#DIV/0!"}},{"$f":"C18","v":0}]
[null,"Vendoring Regional Center",{"$f":"IF(A!C17=\"\",\"\",A!C17)","v":""},null,null,null,null,null,"Calculated Management Wages (Revised)",{"$f":"(A!BZ78+A!CD78)/(A!CB78+A!CF78)","v":{"$error":"#DIV/0!"}},{"$f":"C18","v":0}]
[null,null,null,null,null,null,null,null,"Calculated Administrative Wages (Original)",{"$f":"A!CG78/A!CJ78","v":{"$error":"#DIV/0!"}},{"$f":"IFERROR(A!CS78*(1/(A!CJ78/(2080/12))),0)","v":0}]
[null,{"$f":"\"Payroll & Liability Costs (\"&TEXT((SUM(C10:C14)+SUM(H10:H14)),\"0.00%\")&\" Total)\"","v":"Payroll & Liability Costs (8.35% Total)"},null,null,null,null,null,null,"Calculated Administrative Wages (Revised)",{"$f":"A!CH78/A!CK78","v":{"$error":"#DIV/0!"}},{"$f":"IFERROR(A!DA78*(1/(A!CK78/(2080/12))),0)","v":0}]
["Employer Payroll Taxes - Federal",null,null,null,"Employer Payroll Taxes - State",null,null,null,"Administrative Ratio",{"$f":"A!CJ24","v":0}]
[null,"Social Security / FICA",6.2E-2,null,"SUI (CA State Unemployment Ins.)",null,null,null,"Calculated Other1 Wages (Original)",{"$f":"A!AW78/A!AY78","v":{"$error":"#DIV/0!"}},{"$f":"H17","v":0}]
{"$rows_left_out":69}
{"sheet":"C","index":2,"n_rows":102,"n_cols":19,"rows_kept":102,"cut":false,"hidden":false,"merged":[[7,1,7,7],[15,1,15,7],[19,1,19,7],[28,1,28,4],[37,1,37,4],[29,1,29,4],[30,1,30,4],[31,1,31,4],[32,1,32,4],[33,1,33,4],[49,1,49,4],[46,1,46,4],[47,1,47,4],[48,1,48,4],[34,1,34,4],[35,1,35,4],[36,1,36,4],[38,1,38,4],[39,1,39,4],[41,1,41,4],[42,1,42,4],[43,1,43,4],[44,1,44,4],[40,1,40,4],[91,2,91,7],[99,1,100,5],[99,7,100,7],[56,1,56,2],[56,3,56,4],[57,1,57,2],[68,3,68,4],[69,3,69,4],[57,3,57,4],[65,3,65,4],[84,1,84,4],[66,3,66,4],[67,3,67,4],[64,1,64,2],[64,3,64,4],[83,1,83,4],[26,14,26,18],[80,1,80,4],[81,1,81,4],[82,1,82,4],[26,9,26,13],[52,1,52,2],[53,1,53,2],[54,1,54,2],[55,1,55,2],[61,1,61,2],[52,3,52,4],[53,3,53,4],[54,3,54,4],[55,3,55,4],[61,3,61,4],[45,1,45,4],[75,1,75,7],[73,1,73,2],[65,1,65,2],[66,1,66,2],[67,1,67,2],[68,1,68,2],[69,1,69,2],[72,1,72,2],[72,3,72,4],[73,3,73,4],[70,1,70,2],[70,3,70,4],[71,1,71,2],[71,3,71,4],[85,1,85,4],[86,1,86,4],[87,1,87,4],[88,1,88,4],[89,1,89,4],[50,5,51,5],[50,3,51,4],[62,3,63,4],[62,5,63,5],[62,1,63,2],[50,1,51,2],[58,1,58,2],[58,3,58,4],[59,1,59,2],[59,3,59,4],[60,1,60,2],[60,3,60,4]]}
["SECTION C: ADDITIONAL PROGRAM COSTS",null,null,null,null,null,null,null,"Calculated Other Wages (Original)",{"$f":"A!AW78/A!AY78","v":{"$error":"#DIV/0!"}},{"$f":"H18","v":0},"[second is benefits]"]
[null,null,null,null,null,null,null,null,"Calucalted Other Wages (Revised)",{"$f":"A!AX78/A!AZ78","v":{"$error":"#DIV/0!"}},{"$f":"H18","v":0}]
[null,"Service Provider Name",{"$f":"IF(A!C4=\"\",\"\",A!C4)","v":""},null,null,null,null,null,"Calculated Direct Support Wages (Original)",{"$f":"A!BM78/A!BO78","v":{"$error":"#DIV/0!"}},{"$f":"C17","v":0}]
[null,"Vendor Number",{"$f":"IF(A!C5=\"\",\"\",A!C5)","v":""},null,null,null,null,null,"Calculated Direct Support Wages (Revised)",{"$f":"A!BN78/A!BP78","v":{"$error":"#DIV/0!"}},{"$f":"C17","v":0}]
[null,"Service Code",{"$f":"IF(A!C7=\"\",\"\",A!C7)","v":""},null,null,null,null,null,"Calculated Management Wages (Original)",{"$f":"A!BY78/A!CA78","v":{"$error":"#DIV/0!"}},{"$f":"C18","v":0}]
[null,"Vendoring Regional Center",{"$f":"IF(A!C17=\"\",\"\",A!C17)","v":""},null,null,null,null,null,"Calculated Management Wages (Revised)",{"$f":"A!BZ78/A!CB78","v":{"$error":"#DIV/0!"}},{"$f":"C18","v":0}]
[null,null,null,null,null,null,null,null,"Calculated Administrative Wages (Original)",{"$f":"A!CG78/A!CJ78","v":{"$error":"#DIV/0!"}},{"$f":"IFERROR(A!CS78*(1/(A!CJ78/(2080/12))),0)","v":0}]
[null,{"$f":"\"Payroll & Liability Costs (\"&TEXT((SUM(C10:C14)+SUM(H10:H14)),\"0.00%\")&\" Total)\"","v":"Payroll & Liability Costs (10.00% Total)"},null,null,null,null,null,null,"Calculated Administrative Wages (Revised)",{"$f":"A!CH78/A!CK78","v":{"$error":"#DIV/0!"}},{"$f":"IFERROR(A!DA78*(1/(A!CK78/(2080/12))),0)","v":0}]
["Employer Payroll Taxes - Federal",null,null,null,"Employer Payroll Taxes - State",null,null,null,"Administrative Ratio",{"$f":"A!CJ24","v":0}]
["Social Security / FICA",null,6.2E-2,null,"SUI (CA State Unemployment Ins.)"]
{"$rows_left_out":93}
{"sheet":"D","index":3,"n_rows":89,"n_cols":184,"rows_kept":89,"cut":false,"hidden":false,"merged":[[61,166,61,170],[61,159,61,163],[53,5,53,6],[27,3,27,4],[20,1,20,2],[58,1,58,2],[59,1,59,2],[60,1,60,2],[53,0,53,2],[41,0,41,2],[42,0,42,1],[28,0,28,1],[27,0,27,2],[25,1,25,2],[61,155,61,157],[61,152,61,154],[70,152,72,154],[41,5,41,6],[71,3,71,4],[71,5,71,6],[62,15,62,16],[61,29,61,34],[61,143,61,146],[61,139,61,142],[62,35,62,82],[62,87,62,128],[62,17,63,17],[62,5,62,6],[53,3,53,4],[57,1,57,2],[17,1,17,2],[74,3,74,7],[41,3,41,4],[27,5,27,6],[49,1,49,2],[50,1,50,2],[51,1,51,2],[54,1,54,2],[55,1,55,2],[62,3,62,4],[38,1,38,2],[39,1,39,2],[32,1,32,2],[33,1,33,2],[26,0,26,8],[23,1,23,2],[44,1,44,2],[29,1,29,2],[30,1,30,2],[35,1,35,2],[36,1,36,2],[37,1,37,2],[73,1,73,2],[72,0,73,0],[72,8,73,8],[4,0,4,8],[69,1,69,2],[71,0,71,2],[52,0,52,8],[61,0,61,8],[70,0,70,8],[6,0,6,1],[5,0,5,2],[62,0,62,1],[5,5,5,6],[5,3,5,4],[11,1,11,2],[14,1,14,2],[63,0,63,1],[40,0,40,8],[0,0,0,8],[1,0,1,8],[72,1,72,2],[2,0,2,2],[2,5,2,7],[3,0,3,2],[3,3,3,4],[2,3,2,4],[3,5,3,7],[56,1,56,2],[46,1,46,2],[47,1,47,2],[48,1,48,2],[8,1,8,2]]}
["SECTION D: MONTHLY PROGRAM BUDGET",null,null,null,null,null,null,null,null,null,"New Service?",{"$f":"IF(A!AC1=\"NO\",TRUE,FALSE)","v":false}]
[null,null,null,null,null,null,null,null,null,null,"# Of Months",{"$f":"IF(N2=0,3,N2)","v":3},null,{"$f":"A!C12","v":0}]
[{"$f":"\"Vendor: \"&B!C3","v":"Vendor: "},null,null,{"$f":"\"Rate Type: \"&A!C16","v":"Rate Type: "},null,{"$f":"\"Vendor Number: \"&A!C5","v":"Vendor Number: "},null,null,{"$f":"\"Consumers in Program: \"&A!C9","v":"Consumers in Program: "},null,"Type",{"$f":"A!X19","v":"Reg"}]
[{"$f":"L2&\" Month Review Period: \"&A!C13","v":"3 Month Review Period: "},null,null,{"$f":"\"Service Code: \"&B!C5","v":"Service Code: "},null,{"$f":"\"Vendoring Regional Center: \"&A!C17","v":"Vendoring Regional Center: "},null,null,{"$f":"\"Consumers in Request: \"&A!C10","v":"Consumers in Request: "}]
[]
["Direct Program Costs",null,null,"Current",null,"Proposed",null,"Difference"]
[null,null,"Hours","Rate","Total","Rate","Total","Total","Notes",null,"Name","Same Hours?",null,"Current","Proposed"]
[null,{"$f":"M8","v":"Direct Support - Wages"},{"$f":"IF(L1=TRUE,\"\",IF(N8=0,\"\",IF(AI58=\"no\",O8,N8)))","v":""},{"$f":"IFERROR(IF(L3=\"LMW\",B!J19,B!J3),0)","v":0},{"$f":"IF(L1=TRUE,0,IFERROR(C8*D8,0))","v":0},{"$f":"IFERROR(IF(L3=\"LMW\",B!J20,B!J4),0)","v":0},{"$f":"O8*F8","v":0},{"$f":"G8-E8","v":0},{"$f":"IF(L8=TRUE,\"\",\"Proposed Hours = \"&TEXT(O8,\"0.00\"))","v":""},{"$f":"E8=G8","v":true},null,{"$f":"N8=O8","v":true},{"$f":"IF(L3=\"LMW\",\"Direct Support - Wages (M.Wage Only)\",\"Direct Support - Wages\")","v":"Direct Support - Wages"},{"$f":"IF(L3=\"LMW\",A!BS78/L2,IF(L1=TRUE,0,A!BO78/L2))","v":0},{"$f":"IF(L3=\"LMW\",A!BT78/L2,A!BP78/L2)","v":0}]
[null,"Direct Support - Payroll & Liability",null,{"$f":"IF(D8=0,\"\",B!C15)","v":""},{"$f":"IF(L1=TRUE,0,IFERROR(SUM(E8:E8)*D9,0))","v":0},{"$f":"IF(F8=0,\"\",B!C15)","v":""},{"$f":"IFERROR(SUM(G8:G8)*F9,0)","v":0},{"$f":"G9-E9","v":0},null,{"$f":"E9=G9","v":true}]
[null,"Direct Support - Benefits",{"$f":"IF(L1=TRUE,\"\",IF(N8=0,\"\",\"FTE = \"&ROUND((SUM(C8)/(2080/12)),2)))","v":""},{"$f":"IF(N8=0,0,B!C17/L2)","v":0},{"$f":"IF(L1=TRUE,0,IFERROR((SUM(N8)/(2080/12))*D10,0))","v":0},{"$f":"IF(O8=0,0,B!C17/L2)","v":0},{"$f":"(SUM(O8)/(2080/12))*F10","v":0},{"$f":"G10-E10","v":0},{"$f":"\"Proposed FTE = \"&ROUND((SUM(O8)/(2080/12)),2)","v":"Proposed FTE = 0"},true]
{"$rows_left_out":80}
{"sheet":"E3-Cons","index":4,"n_rows":20,"n_cols":1,"rows_kept":20,"cut":false,"hidden":true,"merged":[]}
["SECTION E: CONSUMER INFORMATION"]
[]
["1. Names (or Initials) of Consumers and UCI #:"]
[]
[]
[]
["2. Provide a detailed description of the health and safety risk(s) and challenges.  Provide a detailed description of what service changes are necessary to protect the consumer's health and safety."]
[]
[]
[]
{"$rows_left_out":11}
{"sheet":"E","index":5,"n_rows":16,"n_cols":6,"rows_kept":16,"cut":false,"hidden":false,"merged":[]}
["SECTION E: HEALTH AND SAFETY WAIVER REGIONAL CENTER CHECKLIST"]
["* Please include the following documentation with the submission. "]
["* If Not Included or N/A, please explain in the notes why this information was not included."]
[]
[null,null,"Included","Not Included","N/A","Notes"]
[1,"Current IPP and/or Addendums"]
[2,"Behavior Plan (if request is due to behavioral challenges)"]
[3,"Vendor Program Design"]
[4,"Vendor Organizational Chart (includes staffing ratio and service assignments)"]
[5,"Consumer and Staff Monthly Schedule, IHSS Hours, Day Program Hours, etc. (Required for SLS/PA Services)"]
{"$rows_left_out":7}
{"sheet":"F","index":6,"n_rows":186,"n_cols":18,"rows_kept":186,"cut":false,"hidden":false,"merged":[[9,6,9,7],[10,6,10,7],[12,6,12,7],[28,0,28,3],[14,6,14,15],[15,6,15,15],[16,6,16,15],[18,6,18,15],[19,6,19,15],[20,6,20,15],[21,6,21,15],[17,0,17,15],[22,4,22,5],[22,6,22,7],[22,8,22,9],[22,10,22,11],[22,12,22,13],[22,14,22,15],[23,4,23,5],[42,0,42,14],[32,0,32,8],[32,10,32,15],[33,0,33,15],[34,0,34,15],[35,0,35,15],[39,0,39,15],[40,0,40,8],[40,10,40,15],[41,0,41,8],[30,0,30,15],[36,0,36,15],[28,12,28,13],[3,0,3,8],[3,10,3,15],[4,0,4,8],[4,10,4,15],[2,0,2,15],[24,14,24,15],[25,14,25,15],[26,14,26,15],[24,8,24,9],[27,14,27,15],[24,10,24,11],[25,10,25,11],[26,10,26,11],[27,10,27,11],[24,12,24,13],[25,12,25,13],[26,12,26,13],[27,12,27,13],[23,6,23,7],[23,8,23,9],[23,10,23,11],[23,12,23,13],[23,14,23,15],[37,10,37,15],[38,0,38,8],[38,10,38,15],[24,0,24,3],[25,0,25,3],[26,0,26,3],[27,0,27,3],[29,14,29,15],[29,10,29,11],[31,0,31,8],[31,10,31,15],[24,4,24,5],[25,4,25,5],[26,4,26,5],[27,4,27,5],[28,4,28,5],[5,0,5,8],[5,10,5,15],[6,0,6,8],[6,10,6,15],[7,10,7,15],[7,0,7,8],[8,0,8,15],[41,10,41,15],[28,10,28,11],[28,14,28,15],[26,8,26,9],[27,8,27,9],[28,8,28,9],[24,6,24,7],[25,6,25,7],[26,6,26,7],[27,6,27,7],[28,6,28,7],[25,8,25,9],[29,12,29,13],[13,0,13,15],[37,0,37,8]]}
["SECTION F: HEALTH AND SAFETY WAIVER EXEMPTION REQUEST"]
[]
["A. Regional Center Information"]
[{"$f":"IFERROR(VLOOKUP(Q4,'RC'!A:B,2,FALSE),\"\")","v":""},null,null,null,null,null,null,null,null,null,null,null,null,null,null,null,{"$f":"IF(A!C17=\"\",\"\",A!C17)","v":""}]
["1. Contact Name"]
[]
["2. Contact Phone Number                                   ",null,null,null,null,null,null,null,null,null,"3. Contact Email"]
[]
["B. Consumer Information"]
["1. Number of Consumers in Program:",null,null,null,null,null,{"$f":"A!C9","v":0}]
{"$rows_left_out":177}
{"sheet":"RC","index":7,"n_rows":21,"n_cols":2,"rows_kept":21,"cut":false,"hidden":true,"merged":[]}
["ACRC","Alta California Regional Center"]
["CVRC","Central Valley Regional Center"]
["ELARC","Eastern Los Angeles Regional Center"]
["FNRC","Far Northern Regional Center"]
["FDLRC","Frank D. Lanterman Regional Center"]
["GGRC","Golden Gate Regional Center"]
["HRC","Harbor Regional Center"]
["IRC","Inland Regional Center"]
["KRC","Kern Regional Center"]
["NBRC","North Bay Regional Center"]
{"$rows_left_out":12}
{"sheet":"H","index":8,"n_rows":48,"n_cols":37,"rows_kept":48,"cut":false,"hidden":true,"merged":[[5,9,7,9],[3,1,3,9],[5,2,7,2],[5,3,7,3],[5,5,7,5],[5,6,7,6],[5,7,7,7],[5,8,7,8],[4,5,4,8]]}
[null,null,null,null,null,null,"Reporting Period Months",{"$f":"IF(A!C12<3,3,A!C12)","v":3}]
[]
[null,null,null,null,null,null,null,null,null,null,null,null,"[Primary]"]
[null,"Roster of Employees that work under multiple service codes"]
[null,null,null,null,null,"* Only enter 1 pay type (Salary or Hourly) per Staff",null,null,null,null,null,null,"[Worksheet]"]
[null,null,{"$f":"\"Worksheet Hours\"&CHAR(10)&\n\"(\"&M8&\")\"","v":"Worksheet Hours\n()"},{"$f":"\"Worksheet Hourly Wage\"&CHAR(10)&\n\"(\"&M8&\")\"","v":"Worksheet Hourly Wage\n()"},"Calcuated Hours","Monthly\nSalary","Monthly \nSalaried \nHours ","Hourly\nWage",{"$f":"\"Reporting Period \"&CHAR(10)&\n\"Hours (\"&H1&\" Mo.)\"","v":"Reporting Period \nHours (3 Mo.)"},"% of Admin",null,"Total %","Vendor #1","Vendor #2","Vendor #3","Vendor #4","Vendor #5","Vendor #6","Vendor #7","Vendor #8","Vendor #9","Vendor #10","Vendor #11","Vendor #12","Vendor #13","Vendor #14","Vendor #15","Vendor #16","Vendor #17","Vendor #18","Vendor #19","Vendor #20","Vendor #21","Vendor #22","Vendor #23","Vendor #24","Vendor #25"]
[null,null,null,null,null,null,null,null,null,null,null,"Service Code",{"$f":"IF(A!C7=0,\"\",A!C7)","v":""},515]
[null,"Staff",null,null,null,null,null,null,null,null,null,"Vendor Number",{"$f":"IF(A!C5=0,\"\",A!C5)","v":""},"HXXXXX"]
[1,"Sample Employee #1",{"$f":"E9*M9","v":173.33},{"$f":"IF(IF((IFERROR(F9/G9,0))>H9,F9/G9,H9)=0,\"\",IF((IFERROR(F9/G9,0))>H9,F9/G9,H9))","v":57.693417181099633},{"$f":"IF(G9>I9,G9,I9)","v":173.33},10000,173.33,null,null,0.5,null,{"$f":"IF(SUM(M9:AK9)=0,\"\",SUM(M9:AK9))","v":1},1]
[2,"Sample Employee #2",{"$f":"E10*M10","v":260},{"$f":"IF(IF((IFERROR(F10/G10,0))>H10,F10/G10,H10)=0,\"\",IF((IFERROR(F10/G10,0))>H10,F10/G10,H10))","v":25},{"$f":"IF(G10>I10,G10,I10)","v":1040},null,null,25,1040,0.25,null,{"$f":"IF(SUM(M10:AK10)=0,\"\",SUM(M10:AK10))","v":1},0.25,0.75]
{"$rows_left_out":39}
{"sheet":"C2","index":9,"n_rows":61,"n_cols":29,"rows_kept":61,"cut":false,"hidden":true,"merged":[[12,8,12,10],[4,8,4,10],[10,8,10,10],[11,3,11,6],[34,8,34,11],[13,11,13,12],[31,10,32,11],[12,11,12,12],[34,1,34,5],[12,3,12,6],[13,3,13,6],[6,3,6,4],[7,3,7,4],[8,3,8,4],[9,3,9,4],[10,3,10,6],[1,3,1,6],[2,3,2,6],[3,3,3,6],[4,3,4,6],[5,3,5,4],[1,11,1,12],[2,11,2,12],[3,11,3,12],[1,8,1,10],[2,8,2,10],[3,8,3,10],[1,1,1,2],[2,1,2,2],[11,1,11,2],[3,1,3,2],[4,1,4,2],[10,1,10,2],[53,7,53,8],[52,7,52,8],[60,7,60,8],[47,4,47,5],[12,1,12,2],[13,1,13,2],[50,7,50,8],[51,7,51,8],[28,1,28,9],[13,8,13,10],[42,7,42,8],[43,7,43,8],[44,7,44,8],[45,7,45,8],[46,7,46,8],[35,1,35,5],[61,7,61,8],[54,7,54,8],[55,7,55,8],[56,7,56,8],[57,7,57,8],[58,7,58,8],[59,7,59,8],[49,4,49,5],[49,6,49,8],[36,1,36,5],[37,1,37,5],[35,8,35,11],[49,11,49,12],[49,9,49,10],[40,9,40,10],[41,7,41,8],[40,6,40,8],[40,11,40,12],[36,8,36,11],[37,8,37,11],[40,4,40,5]]}
["SECTION A: AGENCY INFORMATION"]
[1,"Service Provider Name",null,"Toolworks",null,null,null,9,"3 Month Review Period: (Enter Beginning & End)",null,null,null,null,null,null,null,null,null,null,null,null,null,null,null,"Hourly"]
[2,"Vendor Number",null,null,null,null,null,10,"City/County Affected by Minimum Wage Increase",null,null,"Berkeley",null,null,null,null,null,null,null,null,null,null,null,null,"Daily"]
[3,"Vendor Address",null,null,null,null,null,11,"Effective Date of Minimum Wage Increase",null,null,null,null,null,null,null,null,null,null,null,null,null,null,null,"Monthly"]
[4,"Service Code",null,896,null,null,null,12,"Previous Local Minimum Wage",null,null,12.53,null,null,null,null,null,null,null,null,null,null,null,null,"Mixed"]
[null,null,null,null,null,null,null,null,null,null,null,null,null,null,{"$f":"D6","v":0},1]
[null,null,null,null,null,null,null,null,null,null,null,null,null,null,{"$f":"D7","v":0},2]
[null,null,null,null,null,null,null,null,null,null,null,null,null,null,{"$f":"D8","v":0},3]
[null,null,null,null,null,null,null,null,null,null,null,null,null,null,{"$f":"D9","v":0},4]
[null,null,null,null,null,null,null,null,null,null,null,null,null,null,{"$f":"D10","v":0},5]
{"$rows_left_out":52}
{"sheet":"E2","index":10,"n_rows":190,"n_cols":17,"rows_kept":190,"cut":false,"hidden":true,"merged":[[5,0,5,8],[2,0,2,8],[2,10,2,15],[3,0,3,8],[3,10,3,15],[4,0,4,15],[6,0,6,8],[6,10,6,15],[7,0,7,8],[7,10,7,15],[8,0,8,8],[8,10,8,15],[9,0,9,8],[9,10,9,15],[10,0,10,7],[10,10,10,15],[11,0,11,8],[11,10,11,15],[24,10,24,11],[12,0,12,8],[12,10,12,15],[13,0,13,15],[14,10,14,11],[15,10,15,11],[16,10,16,11],[17,10,17,11],[18,0,18,15],[20,10,20,15],[22,0,22,15],[23,10,23,11],[29,14,29,15],[25,10,25,11],[26,10,26,11],[27,0,27,15],[28,4,28,5],[28,6,28,7],[28,8,28,9],[28,10,28,11],[28,12,28,13],[28,14,28,15],[29,4,29,5],[29,6,29,7],[29,8,29,9],[29,10,29,11],[29,12,29,13],[30,14,30,15],[31,1,31,3],[31,4,31,5],[31,6,31,7],[31,8,31,9],[31,10,31,11],[31,12,31,13],[31,14,31,15],[30,1,30,3],[30,4,30,5],[30,6,30,7],[30,8,30,9],[30,10,30,11],[30,12,30,13],[32,14,32,15],[33,1,33,3],[33,4,33,5],[33,6,33,7],[33,8,33,9],[33,10,33,11],[33,12,33,13],[33,14,33,15],[32,1,32,3],[32,4,32,5],[32,6,32,7],[32,8,32,9],[32,10,32,11],[32,12,32,13],[37,0,37,15],[34,1,34,3],[34,4,34,5],[34,6,34,7],[34,8,34,9],[34,10,34,11],[34,12,34,13],[34,14,34,15],[35,10,35,11],[35,12,35,13],[35,14,35,15],[36,0,36,8],[38,0,38,8],[38,10,38,15],[39,0,39,8],[39,10,39,11],[40,0,40,8],[40,10,40,11],[46,0,46,14],[41,0,41,8],[41,10,41,15],[42,0,42,15],[43,0,43,15],[44,0,44,14],[45,0,45,14]]}
["SECTION E: HEALTH AND SAFETY WAIVER EXEMPTION REQUEST"]
[]
["Date DDS Received Request (DDS ONLY)"]
["Date Assigned to DDS Liaison (DDS ONLY)"]
["A. Regional Center Information"]
["1. Regional Center "]
["Regional Center of the East Bay"]
["2. Contact Name"]
[]
["3. Contact Phone Number                                   ",null,null,null,null,null,null,null,null,null,"4. Contact Email"]
{"$rows_left_out":180}